[zfs-discuss] ZoL 0.6.2 Fails to Build against kernel 3.11.0

Gordan Bobic gordan.bobic at gmail.com
Tue Sep 10 20:39:13 EDT 2013


Making all in module
make[2]: Entering directory `/usr/src/zfs/spl-0.6.2/module'
make -C /usr/src/kernels/3.11.0-2.el6xen.x86_64 SUBDIRS=`pwd` 
CONFIG_SPL=m modules
make[3]: Entering directory `/usr/src/kernels/3.11.0-2.el6xen.x86_64'
   CC [M]  /usr/src/zfs/spl-0.6.2/module/spl/../../module/spl/spl-proc.o
/usr/src/zfs/spl-0.6.2/module/spl/../../module/spl/spl-proc.c:41:69: 
error: missing binary operator before token "("
make[5]: *** 
[/usr/src/zfs/spl-0.6.2/module/spl/../../module/spl/spl-proc.o] Error 1
make[4]: *** [/usr/src/zfs/spl-0.6.2/module/spl] Error 2
make[3]: *** [_module_/usr/src/zfs/spl-0.6.2/module] Error 2
make[3]: Leaving directory `/usr/src/kernels/3.11.0-2.el6xen.x86_64'
make[2]: *** [modules] Error 2
make[2]: Leaving directory `/usr/src/zfs/spl-0.6.2/module'
make[1]: *** [all-recursive] Error 1
make[1]: Leaving directory `/usr/src/zfs/spl-0.6.2'
make: *** [all] Error 2

To unsubscribe from this group and stop receiving emails from it, send an email to zfs-discuss+unsubscribe at zfsonlinux.org.



More information about the zfs-discuss mailing list